Target
Sodium channel protein type 9 subunit alpha
Ligand
BDBM360324
Substrate
Meas. Tech.
FLIPR Assays
IC50
102±22 nM
Citation
 Tafesse, LYao, JZhou, X Benzimidazole derivatives and use thereof US Patent  US9828348 Publication Date 11/28/2017 
Target
Name:
Sodium channel protein type 9 subunit alpha
Synonyms:
NENA Peripheral sodium channel 1 SCN9A_HUMAN Voltage-gated sodium channel subunit Nav1.7 hNE-Na
Type:
Protein
Mol. Mass.:
226375.97
Organism:
Homo sapiens (Human)
Description:
Q15858
Residue:
1988
  
Inhibitor
Name:
BDBM360324
Synonyms:
US9828348, Compound 11 | US9975858, Compound 11
Type:
Small organic molecule
Emp. Form.:
C22H15FN4O
Mol. Mass.:
370.3791
SMILES:
Fc1ccc(Oc2ccc(cc2)-n2c(nc3ccccc23)-c2c[nH]cn2)cc1
: