Target
Sodium channel protein type 9 subunit alpha
Ligand
BDBM360328
Substrate
Meas. Tech.
FLIPR Assays
IC50
957±92 nM
Citation
 Tafesse, LYao, JZhou, X Benzimidazole derivatives and use thereof US Patent  US9828348 Publication Date 11/28/2017 
Target
Name:
Sodium channel protein type 9 subunit alpha
Synonyms:
NENA Peripheral sodium channel 1 SCN9A_HUMAN Voltage-gated sodium channel subunit Nav1.7 hNE-Na
Type:
Protein
Mol. Mass.:
226375.97
Organism:
Homo sapiens (Human)
Description:
Q15858
Residue:
1988
  
Inhibitor
Name:
BDBM360328
Synonyms:
US9828348, Compound 16 | US9975858, Compound 16
Type:
Small organic molecule
Emp. Form.:
C23H18FN5O
Mol. Mass.:
399.4203
SMILES:
Cc1nnc(Cc2nc3ccccc3n2-c2ccc(Oc3ccc(F)cc3)cc2)[nH]1
: