Target
Orexin/Hypocretin receptor type 1
Ligand
BDBM330343
Substrate
IC50
1080±n/a nM
Citation
 Liverton, NBeshore, DCKuduk, SDLuo, YMeng, NYu, T Oxazole orexin receptor antagonists US Patent  US9828368 Publication Date 11/28/2017 
Target
Name:
Orexin/Hypocretin receptor type 1
Synonyms:
Hcrtr1 OX1R_RAT Orexin receptor type 1 (OX1R) Ox1-R | Ox1R
Type:
Protein
Mol. Mass.:
46817.55
Organism:
Rattus norvegicus (Rat)
Description:
P56718
Residue:
416
  
Inhibitor
Name:
BDBM330343
Synonyms:
1-(3-{[(3R,6R)- 1-{[6-methoxy- 2-(2H-1,2,3- triazol-2-yl) pyridin-3-yl] carbonyl}-6- methyl- piperidin-3- yl]oxy} phenyl)ethanol US9828368, Example 8
Type:
Small organic molecule
Emp. Form.:
C23H27N5O4
Mol. Mass.:
437.4916
SMILES:
COc1ccc(C(=O)N2C[C@@H](CC[C@H]2C)Oc2cccc(c2)C(C)O)c(n1)-n1nccn1
: