Target
Orexin receptor type 2
Ligand
BDBM360381
Substrate
Meas. Tech.
FLIPR Ca2+ Flux Assay
IC50
19.1±n/a nM
Citation
 Liverton, NBeshore, DCKuduk, SDLuo, YMeng, NYu, T Oxazole orexin receptor antagonists US Patent  US9828368 Publication Date 11/28/2017 
Target
Name:
Orexin receptor type 2
Synonyms:
HCRTR2 OX2R_HUMAN Orexin receptor type 2 (OR-2) Orexin receptor type 2 (OX2R) Ox-2-R | Ox2-R
Type:
Protein
Mol. Mass.:
50710.53
Organism:
Homo sapiens (Human)
Description:
O43614
Residue:
444
  
Inhibitor
Name:
BDBM360381
Synonyms:
US9828368, Example 37
Type:
Small organic molecule
Emp. Form.:
C22H26FN5O3
Mol. Mass.:
427.4719
SMILES:
C[C@@H]1CC[C@H](CN1C(=O)c1ccc(F)cc1-n1nccn1)c1nc(c(C)o1)C(C)(C)O
: