Target
Orexin/Hypocretin receptor type 1
Ligand
BDBM360844
Substrate
IC50
55.0±n/a nM
Citation
 Liverton, NBeshore, DCKuduk, SDLuo, YMeng, NYu, T Oxazole orexin receptor antagonists US Patent  US9828368 Publication Date 11/28/2017 
Target
Name:
Orexin/Hypocretin receptor type 1
Synonyms:
Hcrtr1 OX1R_RAT Orexin receptor type 1 (OX1R) Ox1-R | Ox1R
Type:
Protein
Mol. Mass.:
46817.55
Organism:
Rattus norvegicus (Rat)
Description:
P56718
Residue:
416
  
Inhibitor
Name:
BDBM360844
Synonyms:
Phenyl (2-(2H-1,2,3-Triazol-2-yl)phenyl)((2R, 5R)-2-methyl-5-(5-phenyloxazol-2-yl)piperidin-1- yl)methanone | US9828368, Example 74
Type:
Small organic molecule
Emp. Form.:
C24H23N5O2
Mol. Mass.:
413.4717
SMILES:
C[C@@H]1CC[C@H](CN1C(=O)c1ccccc1-n1nccn1)c1ncc(o1)-c1ccccc1
: