Target
Thyroid hormone receptor beta
Ligand
BDBM18884
Substrate
BDBM18860
Meas. Tech.
TRbeta-Binding Assay
pH
7±n/a
Temperature
277.15±n/a K
IC50
35±12 nM
Citation
 Koehler, KGordon, SBrandt, PCarlsson, BBäcksbro-Saeidi, AApelqvist, TAgback, PGrover, GJNelson, WGrynfarb, MFärnegård, MRehnmark, SMalm, J Thyroid receptor ligands. 6. A high affinity "direct antagonist" selective for the thyroid hormone receptor. J Med Chem 49:6635-7 (2006)  
Target
Name:
Thyroid hormone receptor beta
Synonyms:
ERBA2 Nuclear receptor subfamily 1 group A member 2 THR1 c-erbA-2 | c-erbA-beta
Type:
Receptor
Mol. Mass.:
52793.62
Organism:
Homo sapiens (Human)
Description:
Recombinant hThR was obtained from nuclear extracts from SF9 cells infected with baculovirus vectors encoding for ThRbeta 1.
Residue:
461
  
Inhibitor
Name:
BDBM18884
Synonyms:
2-(4-{[4-hydroxy-3-(4-nitrophenyl)-5-(propan-2-yl)phenyl]methyl}-3,5-dimethylphenoxy)acetic acid JMC496635 Compound 4 | thyromimetic, 5a
Type:
Small organic molecule
Emp. Form.:
C26H27NO6
Mol. Mass.:
449.4957
SMILES:
CC(C)c1cc(Cc2c(C)cc(OCC(O)=O)cc2C)cc(c1O)-c1ccc(cc1)[N+]([O-])=O
:
Substrate
Name:
BDBM18860
Synonyms:
(2R)-2-amino-3-[4-(4-hydroxy-3-iodophenoxy)-3,5-diiodophenyl]propanoic acid 3,5,3'-triiodo-L-thyronine (T3) Triiodothyronine US10544075, Compound T3 liothyronine | triothyrone
Type:
Hormone
Emp. Form.:
C15H12I3NO4
Mol. Mass.:
650.9735
SMILES:
N[C@@H](Cc1cc(I)c(Oc2ccc(O)c(I)c2)c(I)c1)C(O)=O
: