Target
Glutamate receptor ionotropic, NMDA 2B
Ligand
BDBM235341
Substrate
Meas. Tech.
FDSS Assay
IC50
20.4±n/a nM
Citation
 Anderson, DRVolkmann, RAMenniti, FS Selective octahydro-cyclopenta[C] pyrrole negative modulators of NR2B US Patent  US10052306 Publication Date 8/21/2018 
Target
Name:
Glutamate receptor ionotropic, NMDA 2B
Synonyms:
GRIN2B Glutamate [NMDA] receptor subunit epsilon 2 N-methyl D-aspartate receptor subtype 2B NMDAR2B NR3 | hNR3
Type:
PROTEIN
Mol. Mass.:
166375.46
Organism:
Homo sapiens (Human)
Description:
ChEMBL_1438829
Residue:
1484
  
Inhibitor
Name:
BDBM235341
Synonyms:
(3aR,5S,6aS)-5-benzyl-2- ((S)-2-hydroxy-2-(4- hydroxyphenyl)ethyl)octa- hydrocyclopenta[c]pyrrol- 5-ol US10052306, 143
Type:
Small organic molecule
Emp. Form.:
C22H27NO3
Mol. Mass.:
353.4547
SMILES:
O[C@H](CN1C[C@H]2C[C@](O)(Cc3ccccc3)C[C@H]2C1)c1ccc(O)cc1
: