Target
Glutamate receptor ionotropic, NMDA 2B
Ligand
BDBM237699
Substrate
Meas. Tech.
FDSS Assay
IC50
23.8±n/a nM
Citation
 Anderson, DRVolkmann, RAMenniti, FS Selective octahydro-cyclopenta[C] pyrrole negative modulators of NR2B US Patent  US10052306 Publication Date 8/21/2018 
Target
Name:
Glutamate receptor ionotropic, NMDA 2B
Synonyms:
GRIN2B Glutamate [NMDA] receptor subunit epsilon 2 N-methyl D-aspartate receptor subtype 2B NMDAR2B NR3 | hNR3
Type:
PROTEIN
Mol. Mass.:
166375.46
Organism:
Homo sapiens (Human)
Description:
ChEMBL_1438829
Residue:
1484
  
Inhibitor
Name:
BDBM237699
Synonyms:
US10052306, 245 | rac-5-(2,4- difluorobenzyl)-2-(2- hydroxy-2-(4- hydroxyphenyl)ethyl) octahydrocyclopenta[c] pyrrol-5-ol
Type:
Small organic molecule
Emp. Form.:
C22H25F2NO3
Mol. Mass.:
389.4356
SMILES:
OC(CN1C[C@H]2C[C@](O)(Cc3ccc(F)cc3F)C[C@H]2C1)c1ccc(O)cc1
: