Target
Glutamate receptor ionotropic, NMDA 2B
Ligand
BDBM238288
Substrate
Meas. Tech.
FDSS Assay
IC50
43.0±n/a nM
Citation
 Anderson, DRVolkmann, RAMenniti, FS Selective octahydro-cyclopenta[C] pyrrole negative modulators of NR2B US Patent  US10052306 Publication Date 8/21/2018 
Target
Name:
Glutamate receptor ionotropic, NMDA 2B
Synonyms:
GRIN2B Glutamate [NMDA] receptor subunit epsilon 2 N-methyl D-aspartate receptor subtype 2B NMDAR2B NR3 | hNR3
Type:
PROTEIN
Mol. Mass.:
166375.46
Organism:
Homo sapiens (Human)
Description:
ChEMBL_1438829
Residue:
1484
  
Inhibitor
Name:
BDBM238288
Synonyms:
US10052306, 280 | rac-(3aR,5R,6aS)-5- benzyl-2-[2-hydroxy-2- (4- hydroxyphenyl)propyl]- octahydrocyclopenta[c] pyrrol-5-ol
Type:
Small organic molecule
Emp. Form.:
C23H29NO3
Mol. Mass.:
367.4813
SMILES:
CC(O)(CN1CC2CC(O)(Cc3ccccc3)CC2C1)c1ccc(O)cc1
: