Target
Glutamate receptor ionotropic, NMDA 2B
Ligand
BDBM238863
Substrate
Meas. Tech.
FDSS Assay
IC50
20.1±n/a nM
Citation
 Anderson, DRVolkmann, RAMenniti, FS Selective octahydro-cyclopenta[C] pyrrole negative modulators of NR2B US Patent  US10052306 Publication Date 8/21/2018 
Target
Name:
Glutamate receptor ionotropic, NMDA 2B
Synonyms:
GRIN2B Glutamate [NMDA] receptor subunit epsilon 2 N-methyl D-aspartate receptor subtype 2B NMDAR2B NR3 | hNR3
Type:
PROTEIN
Mol. Mass.:
166375.46
Organism:
Homo sapiens (Human)
Description:
ChEMBL_1438829
Residue:
1484
  
Inhibitor
Name:
BDBM238863
Synonyms:
US10052306, 302 | rac-4-{2-[(3aR,5R,6aS)- 5-benzyl- octahydrocyclopenta[c] pyrrol-2-yl]-1- hydroxyethyl}-2- fluorophenol
Type:
Small organic molecule
Emp. Form.:
C22H26FNO2
Mol. Mass.:
355.4457
SMILES:
OC(CN1C[C@@H]2C[C@@H](Cc3ccccc3)C[C@@H]2C1)c1ccc(O)c(F)c1
: