Target
Glutamate receptor ionotropic, NMDA 2B
Ligand
BDBM238868
Substrate
Meas. Tech.
FDSS Assay
IC50
41.2±n/a nM
Citation
 Anderson, DRVolkmann, RAMenniti, FS Selective octahydro-cyclopenta[C] pyrrole negative modulators of NR2B US Patent  US10052306 Publication Date 8/21/2018 
Target
Name:
Glutamate receptor ionotropic, NMDA 2B
Synonyms:
GRIN2B Glutamate [NMDA] receptor subunit epsilon 2 N-methyl D-aspartate receptor subtype 2B NMDAR2B NR3 | hNR3
Type:
PROTEIN
Mol. Mass.:
166375.46
Organism:
Homo sapiens (Human)
Description:
ChEMBL_1438829
Residue:
1484
  
Inhibitor
Name:
BDBM238868
Synonyms:
2-[(3aR,5S,6aS)-5- benzyl- octahydrocyclopenta[c] pyrrol-2-yl]-1-(3-fluoro- 4-hydroxyphenyl) ethan-1-one | US10052306, 307
Type:
Small organic molecule
Emp. Form.:
C22H24FNO2
Mol. Mass.:
353.4299
SMILES:
Oc1ccc(cc1F)C(=O)CN1C[C@@H]2C[C@H](Cc3ccccc3)C[C@@H]2C1
: