Target
Thyroid hormone receptor beta
Ligand
BDBM18961
Substrate
BDBM18860
Meas. Tech.
TRbeta-Binding Assay
pH
7.6±n/a
Temperature
295.15±n/a K
IC50
91000±21000 nM
Citation
 van Beeren, HCBakker, OWiersinga, WM Structure-function relationship of the inhibition of the 3,5,3'-triiodothyronine binding to the alpha1- and beta1-thyroid hormone receptor by amiodarone analogs. Endocrinology 137:2807-14 (1996)  
Target
Name:
Thyroid hormone receptor beta
Synonyms:
Erba2 THB_RAT Thyroid Hormone Receptor (TR-beta) Thyroid hormone receptor beta-1 | thyroid beta
Type:
Enzyme Catalytic Domain
Mol. Mass.:
52661.52
Organism:
RAT
Description:
thyroid beta 0 RAT::P18113
Residue:
461
  
Inhibitor
Name:
BDBM18961
Synonyms:
(2-{4-[(2-butyl-1-benzofuran-3-yl)carbonyl]phenoxy}ethyl)diethylamine DDIA L 3937
Type:
Small organic molecule
Emp. Form.:
C25H31NO3
Mol. Mass.:
393.5185
SMILES:
CCCCc1oc2ccccc2c1C(=O)c1ccc(OCCN(CC)CC)cc1
:
Substrate
Name:
BDBM18860
Synonyms:
(2R)-2-amino-3-[4-(4-hydroxy-3-iodophenoxy)-3,5-diiodophenyl]propanoic acid 3,5,3'-triiodo-L-thyronine (T3) Triiodothyronine US10544075, Compound T3 liothyronine | triothyrone
Type:
Hormone
Emp. Form.:
C15H12I3NO4
Mol. Mass.:
650.9735
SMILES:
N[C@@H](Cc1cc(I)c(Oc2ccc(O)c(I)c2)c(I)c1)C(O)=O
: