Target
Diacylglycerol O-acyltransferase 2
Ligand
BDBM360538
Substrate
Meas. Tech.
Enzymatic Activity Assay
IC50
1311±n/a nM
Citation
 Imbriglio, JLondon, CLu, ZTata, JXiong, YYou, MYoum, H Isoquinoline derivatives useful as inhibitors of diacylglyceride O-acyltransferase 2 US Patent  US9828369 Publication Date 11/28/2017 
Target
Name:
Diacylglycerol O-acyltransferase 2
Synonyms:
ARAT DGAT2 Diacylglycerol O-acyltransferase 2 (DGAT2) Retinol O-fatty-acyltransferase
Type:
Multi-pass membrane protein
Mol. Mass.:
43848.90
Organism:
Homo sapiens (Human)
Description:
Q96PD7
Residue:
388
  
Inhibitor
Name:
BDBM360538
Synonyms:
US9828369, Example 95 | tert-butyl 3-(2-(((5-(3- methoxyphenyl)isoquinolin-8- yl)methyl)amino)-2-oxoethyl)-3- phenylpyrrolidine-1-carboxylate
Type:
Small organic molecule
Emp. Form.:
C34H37N3O4
Mol. Mass.:
551.6753
SMILES:
COc1cccc(c1)-c1ccc(CNC(=O)CC2(CCN(C2)C(=O)OC(C)(C)C)c2ccccc2)c2cnccc12
: