Target
Diacylglycerol O-acyltransferase 2
Ligand
BDBM360557
Substrate
Meas. Tech.
Enzymatic Activity Assay
IC50
6111±n/a nM
Citation
 Imbriglio, JLondon, CLu, ZTata, JXiong, YYou, MYoum, H Isoquinoline derivatives useful as inhibitors of diacylglyceride O-acyltransferase 2 US Patent  US9828369 Publication Date 11/28/2017 
Target
Name:
Diacylglycerol O-acyltransferase 2
Synonyms:
ARAT DGAT2 Diacylglycerol O-acyltransferase 2 (DGAT2) Retinol O-fatty-acyltransferase
Type:
Multi-pass membrane protein
Mol. Mass.:
43848.90
Organism:
Homo sapiens (Human)
Description:
Q96PD7
Residue:
388
  
Inhibitor
Name:
BDBM360557
Synonyms:
N-((5-(3-methoxyphenyl)isoquinolin- 8-yl)methyl)-2-methyl-2-((4- (trifluoromethyl)pyridin-2- yl)oxy)propanamide | US9828369, Example 114
Type:
Small organic molecule
Emp. Form.:
C27H24F3N3O3
Mol. Mass.:
495.493
SMILES:
COc1cccc(c1)-c1ccc(CNC(=O)C(C)(C)Oc2cc(ccn2)C(F)(F)F)c2cnccc12
: