Target
Diacylglycerol O-acyltransferase 2
Ligand
BDBM360567
Substrate
Meas. Tech.
Enzymatic Activity Assay
IC50
2332±n/a nM
Citation
 Imbriglio, JLondon, CLu, ZTata, JXiong, YYou, MYoum, H Isoquinoline derivatives useful as inhibitors of diacylglyceride O-acyltransferase 2 US Patent  US9828369 Publication Date 11/28/2017 
Target
Name:
Diacylglycerol O-acyltransferase 2
Synonyms:
ARAT DGAT2 Diacylglycerol O-acyltransferase 2 (DGAT2) Retinol O-fatty-acyltransferase
Type:
Multi-pass membrane protein
Mol. Mass.:
43848.90
Organism:
Homo sapiens (Human)
Description:
Q96PD7
Residue:
388
  
Inhibitor
Name:
BDBM360567
Synonyms:
2-fluoro-N-((5-(3- methoxyphenyl)isoquinolin-8- yl)methyl)-2-(4- (trifluoromethyl)phenyl)acetamide | US9828369, Example 124
Type:
Small organic molecule
Emp. Form.:
C26H20F4N2O2
Mol. Mass.:
468.4428
SMILES:
COc1cccc(c1)-c1ccc(CNC(=O)C(F)c2ccc(cc2)C(F)(F)F)c2cnccc12
: