Target
Diacylglycerol O-acyltransferase 2
Ligand
BDBM360568
Substrate
Meas. Tech.
Enzymatic Activity Assay
IC50
2462±n/a nM
Citation
 Imbriglio, JLondon, CLu, ZTata, JXiong, YYou, MYoum, H Isoquinoline derivatives useful as inhibitors of diacylglyceride O-acyltransferase 2 US Patent  US9828369 Publication Date 11/28/2017 
Target
Name:
Diacylglycerol O-acyltransferase 2
Synonyms:
ARAT DGAT2 Diacylglycerol O-acyltransferase 2 (DGAT2) Retinol O-fatty-acyltransferase
Type:
Multi-pass membrane protein
Mol. Mass.:
43848.90
Organism:
Homo sapiens (Human)
Description:
Q96PD7
Residue:
388
  
Inhibitor
Name:
BDBM360568
Synonyms:
N-((5-(3-methoxyphenyl)isoquinolin- 8-yl)methyl)-3-methyl-2-(4- (trifluoromethyl)phenyl)butanamide | US9828369, Example 125
Type:
Small organic molecule
Emp. Form.:
C29H27F3N2O2
Mol. Mass.:
492.5321
SMILES:
COc1cccc(c1)-c1ccc(CNC(=O)C(C(C)C)c2ccc(cc2)C(F)(F)F)c2cnccc12
: