Target
Diacylglycerol O-acyltransferase 2
Ligand
BDBM360577
Substrate
Meas. Tech.
Enzymatic Activity Assay
IC50
324±n/a nM
Citation
 Imbriglio, JLondon, CLu, ZTata, JXiong, YYou, MYoum, H Isoquinoline derivatives useful as inhibitors of diacylglyceride O-acyltransferase 2 US Patent  US9828369 Publication Date 11/28/2017 
Target
Name:
Diacylglycerol O-acyltransferase 2
Synonyms:
ARAT DGAT2 Diacylglycerol O-acyltransferase 2 (DGAT2) Retinol O-fatty-acyltransferase
Type:
Multi-pass membrane protein
Mol. Mass.:
43848.90
Organism:
Homo sapiens (Human)
Description:
Q96PD7
Residue:
388
  
Inhibitor
Name:
BDBM360577
Synonyms:
2-([1,1'-biphenyl]-4-yl)-N-((5-(3- methoxyphenyl)isoquinolin-8- yl)methyl)propanamide | US9828369, Example 134
Type:
Small organic molecule
Emp. Form.:
C32H28N2O2
Mol. Mass.:
472.5769
SMILES:
COc1cccc(c1)-c1ccc(CNC(=O)C(C)c2ccc(cc2)-c2ccccc2)c2cnccc12
: