Target
Trace amine-associated receptor 1
Ligand
BDBM360634
Substrate
Meas. Tech.
Radioligand Binding Assay
Ki
26.4±n/a nM
Citation
 Cecere, GGalley, GNorcross, RPatiny-Adam, APflieger, P Substituted pyrazino[2,2-a]isoquinoline derivatives US Patent  US9828374 Publication Date 11/28/2017 
Target
Name:
Trace amine-associated receptor 1
Synonyms:
TAAR1_RAT Taar1 Trace amine receptor 1 (TARR1) Trace amine-associated receptor 1 (TAAR1) Trar1
Type:
Enzyme
Mol. Mass.:
38034.73
Organism:
Rattus norvegicus (Rat)
Description:
Q923Y9
Residue:
332
  
Inhibitor
Name:
BDBM360634
Synonyms:
(11bR)-N-[6-chloro-2-(trifluoromethyl)pyrimidin-4-yl]-2,3,4,6,7,11b-hexahydro-1H-pyrazino[2,1-a]isoquinolin-9-amine | US9828374, Example 21
Type:
Small organic molecule
Emp. Form.:
C17H17ClF3N5
Mol. Mass.:
383.799
SMILES:
FC(F)(F)c1nc(Cl)cc(Nc2ccc3[C@@H]4CNCCN4CCc3c2)n1
: