Target
Trace amine-associated receptor 1
Ligand
BDBM360643
Substrate
Meas. Tech.
Radioligand Binding Assay
Ki
176±n/a nM
Citation
 Cecere, GGalley, GNorcross, RPatiny-Adam, APflieger, P Substituted pyrazino[2,2-a]isoquinoline derivatives US Patent  US9828374 Publication Date 11/28/2017 
Target
Name:
Trace amine-associated receptor 1
Synonyms:
TAAR1_RAT Taar1 Trace amine receptor 1 (TARR1) Trace amine-associated receptor 1 (TAAR1) Trar1
Type:
Enzyme
Mol. Mass.:
38034.73
Organism:
Rattus norvegicus (Rat)
Description:
Q923Y9
Residue:
332
  
Inhibitor
Name:
BDBM360643
Synonyms:
(11bR)-8-fluoro-2,3,4,6,7,11b-hexahydro-1H-pyrazino[2,1-a]isoquinoline | US9828374, Example 30
Type:
Small organic molecule
Emp. Form.:
C12H15FN2
Mol. Mass.:
206.2593
SMILES:
Fc1cccc2[C@@H]3CNCCN3CCc12
: