Target
Integrin alpha-5/beta-1 [T112H]
Ligand
BDBM19063
Substrate
Fibronectin
Meas. Tech.
Specificity of Inhibitors on Cell Adhesion Assay
IC50
>10000±n/a nM
Citation
 Choi, SVilaire, GMarcinkiewicz, CWinkler, JDBennett, JSDeGrado, WF Small molecule inhibitors of integrin alpha2beta1. J Med Chem 50:5457-62 (2007)  
Target
Name:
Integrin alpha-5/beta-1 [T112H]
Synonyms:
Integrin alpha5beta1
Type:
Protein Complex
Mol. Mass.:
Description:
Transfected K562 cell.
Components:
This complex has 2 components.
Component 1
Name:
Integrin beta-1 [T112H]
Synonyms:
CD29 antigen Fibronectin receptor subunit beta ITGB1 Integrin beta1 MSK12
Type:
Membrane Protein
Mol. Mass.:
88450.95
Organism:
Homo sapiens (Human)
Description:
P05556[T112H]
Residue:
798
  
Component 2
Name:
Integrin alpha-5
Synonyms:
CD49 antigen-like family member E FNRA Fibronectin receptor subunit alpha ITGA5 Integrin alpha-F | VLA-5
Type:
Single-pass type I membrane protein
Mol. Mass.:
114523.00
Organism:
Homo sapiens (Human)
Description:
Residue:
1049
  
Inhibitor
Name:
BDBM19063
Synonyms:
(2S)-3-[(benzylcarbamoyl)amino]-2-{[(2S)-1-[(3,5-dimethylbenzene)sulfonyl]pyrrolidin-2-yl]formamido}propanoic acid | prolyl-2,3-diaminopropionic acid (DAP) scaffold, 19
Type:
Small organic molecule
Emp. Form.:
C24H30N4O6S
Mol. Mass.:
502.583
SMILES:
Cc1cc(C)cc(c1)S(=O)(=O)N1CCC[C@H]1C(=O)N[C@@H](CNC(=O)NCc1ccccc1)C(O)=O
:
Substrate
Name:
Fibronectin
Synonyms:
Type:
Other Protein Type
Mol. Mass.:
10187.44
Organism:
Homo sapiens (Human)
Description:
Residue:
95