Target
Cytosolic arginine sensor for mTORC1 subunit 1
Ligand
BDBM315532
Substrate
Meas. Tech.
Inhibition Assay
IC50
<25±n/a nM
Citation
 Ren, PLiu, YLi, LChan, KWilson, TE Kinase inhibitors and methods of use US Patent  US9828378 Publication Date 11/28/2017 
Target
Name:
Cytosolic arginine sensor for mTORC1 subunit 1
Synonyms:
CAST1_HUMAN Cellular arginine sensor for mTORC1 protein 1 GATSL3 | mTORC1 protein 1
Type:
Protein
Mol. Mass.:
36264.36
Organism:
Homo sapiens (Human)
Description:
Q8WTX7
Residue:
329
  
Inhibitor
Name:
BDBM315532
Synonyms:
US10172858, Table 2.27 | US9828378, # 27
Type:
Small organic molecule
Emp. Form.:
C17H16N6O
Mol. Mass.:
320.3485
SMILES:
Nc1ncnc2n(nc(-c3cc4cc(O)ccc4[nH]3)c12)C1CCC1
: