Target
Cytosolic arginine sensor for mTORC1 subunit 1
Ligand
BDBM315547
Substrate
Meas. Tech.
Inhibition Assay
IC50
<5±n/a nM
Citation
 Ren, PLiu, YLi, LChan, KWilson, TE Kinase inhibitors and methods of use US Patent  US9828378 Publication Date 11/28/2017 
Target
Name:
Cytosolic arginine sensor for mTORC1 subunit 1
Synonyms:
CAST1_HUMAN Cellular arginine sensor for mTORC1 protein 1 GATSL3 | mTORC1 protein 1
Type:
Protein
Mol. Mass.:
36264.36
Organism:
Homo sapiens (Human)
Description:
Q8WTX7
Residue:
329
  
Inhibitor
Name:
BDBM315547
Synonyms:
US10172858, Table 2.42 | US9828378, # 42
Type:
Small organic molecule
Emp. Form.:
C18H18N6O2
Mol. Mass.:
350.3745
SMILES:
Nc1ncnc2n(nc(-c3cc4cc(O)ccc4[nH]3)c12)C1CCOCC1
: