Target
E3 ubiquitin-protein ligase XIAP [124-240]
Ligand
BDBM240239
Substrate
Meas. Tech.
TR-FRET Assay for BIR2 and BIR3
pH
7.5±n/a
Temperature
298.15±n/a K
IC50
520±n/a nM
Comments
extracted
Citation
 Chen, SDonnell, AFKester, RFLe, KLou, YMichoud, CRemiszewski, SRupert, KCWeisel, M Tetrahydro-benzodiazepinones US Patent  US10053431 Publication Date 8/21/2018 
Target
Name:
E3 ubiquitin-protein ligase XIAP [124-240]
Synonyms:
6x Histidine-tagged BIR2 domain BIR2 (aa 124-240) E3 ubiquitin-protein ligase (XIAP-BIR2)(C202A/C213G) XIAP XIAP_HUMAN | amino acids 124-240 of XIAP
Type:
Enzyme Catalytic Domain
Mol. Mass.:
13562.46
Organism:
Homo sapiens (Human)
Description:
P98170[124-240]
Residue:
117
  
Inhibitor
Name:
BDBM240239
Synonyms:
(S)-2-Methylamino-N—[(S)-1-(2-methyl-naphthalen-1-naphthalen-1 ylmethyl)-2-oxo-5-(pyridine-4-carbonyl)-2,3,4,5-tetrahydro-1H-benzo[b][1,4]diazepin-3-yl]-propionamide hydrochloride | US10053431, 9
Type:
Small organic molecule
Emp. Form.:
C31H31N5O3
Mol. Mass.:
521.6095
SMILES:
CN[C@@H](C)C(=O)N[C@H]1CN(C(=O)c2ccncc2)c2ccccc2N(Cc2c(C)ccc3ccccc23)C1=O
: