Target
E3 ubiquitin-protein ligase XIAP [124-240]
Ligand
BDBM241649
Substrate
Meas. Tech.
TR-FRET Assay for BIR2 and BIR3
pH
7.5±n/a
Temperature
298.15±n/a K
IC50
503±n/a nM
Comments
extracted
Citation
 Chen, SDonnell, AFKester, RFLe, KLou, YMichoud, CRemiszewski, SRupert, KCWeisel, M Tetrahydro-benzodiazepinones US Patent  US10053431 Publication Date 8/21/2018 
Target
Name:
E3 ubiquitin-protein ligase XIAP [124-240]
Synonyms:
6x Histidine-tagged BIR2 domain BIR2 (aa 124-240) E3 ubiquitin-protein ligase (XIAP-BIR2)(C202A/C213G) XIAP XIAP_HUMAN | amino acids 124-240 of XIAP
Type:
Enzyme Catalytic Domain
Mol. Mass.:
13562.46
Organism:
Homo sapiens (Human)
Description:
P98170[124-240]
Residue:
117
  
Inhibitor
Name:
BDBM241649
Synonyms:
(2S)-N-[(3S)-1-(4-acetylbenzoyl)-5-[2- (naphthalen-1-ylamino)-2-oxoethyl]-4- oxo-2,3-dihydro-1,5-benzodiazepin-3-yl]- 2-(methylamino)propanamide;2,2,2- trifluoroacetic acid | US10053431, 105
Type:
Small organic molecule
Emp. Form.:
C34H33N5O5
Mol. Mass.:
591.6563
SMILES:
CN[C@@H](C)C(=O)N[C@H]1CN(C(=O)c2ccc(cc2)C(C)=O)c2ccccc2N(CC(=O)Nc2cccc3ccccc23)C1=O
: