Target
E3 ubiquitin-protein ligase XIAP [124-240]
Ligand
BDBM242583
Substrate
Meas. Tech.
TR-FRET Assay for BIR2 and BIR3
pH
7.5±n/a
Temperature
298.15±n/a K
IC50
530±n/a nM
Comments
extracted
Citation
 Chen, SDonnell, AFKester, RFLe, KLou, YMichoud, CRemiszewski, SRupert, KCWeisel, M Tetrahydro-benzodiazepinones US Patent  US10053431 Publication Date 8/21/2018 
Target
Name:
E3 ubiquitin-protein ligase XIAP [124-240]
Synonyms:
6x Histidine-tagged BIR2 domain BIR2 (aa 124-240) E3 ubiquitin-protein ligase (XIAP-BIR2)(C202A/C213G) XIAP XIAP_HUMAN | amino acids 124-240 of XIAP
Type:
Enzyme Catalytic Domain
Mol. Mass.:
13562.46
Organism:
Homo sapiens (Human)
Description:
P98170[124-240]
Residue:
117
  
Inhibitor
Name:
BDBM242583
Synonyms:
(2S)-N-(1-methyl-5-((2- methylnaphthalen-1-yl)methyl)-2,4- dioxo-2,3,4,5-tetrahydro-1H- benzo[b][1,4]diazepin-3-yl)-2- (methylamino)butanamide | US10053431, 114
Type:
Small organic molecule
Emp. Form.:
C27H30N4O3
Mol. Mass.:
458.5521
SMILES:
CC[C@H](NC)C(=O)NC1C(=O)N(C)c2ccccc2N(Cc2c(C)ccc3ccccc23)C1=O
: