Target
E3 ubiquitin-protein ligase XIAP [124-240]
Ligand
BDBM242641
Substrate
Meas. Tech.
TR-FRET Assay for BIR2 and BIR3
pH
7.5±n/a
Temperature
298.15±n/a K
IC50
5.11±n/a nM
Comments
extracted
Citation
 Chen, SDonnell, AFKester, RFLe, KLou, YMichoud, CRemiszewski, SRupert, KCWeisel, M Tetrahydro-benzodiazepinones US Patent  US10053431 Publication Date 8/21/2018 
Target
Name:
E3 ubiquitin-protein ligase XIAP [124-240]
Synonyms:
6x Histidine-tagged BIR2 domain BIR2 (aa 124-240) E3 ubiquitin-protein ligase (XIAP-BIR2)(C202A/C213G) XIAP XIAP_HUMAN | amino acids 124-240 of XIAP
Type:
Enzyme Catalytic Domain
Mol. Mass.:
13562.46
Organism:
Homo sapiens (Human)
Description:
P98170[124-240]
Residue:
117
  
Inhibitor
Name:
BDBM242641
Synonyms:
(S)-N-((S)-1-((5-bromo-2- methoxynaphthalen-1-yl)methyl)-7- cyano-5-(4-cyanobenzoyl)-2-oxo-2,3,4,5- tetrahydro-1H-benzo[b][1,4]diazepin-3- yl)-2-(methylamino)propanamide hydrochloride | US10053431, 143
Type:
Small organic molecule
Emp. Form.:
C34H29BrN6O4
Mol. Mass.:
665.536
SMILES:
CN[C@@H](C)C(=O)N[C@H]1CN(C(=O)c2ccc(cc2)C#N)c2cc(ccc2N(Cc2c(OC)ccc3c(Br)cccc23)C1=O)C#N
: