Target
Gamma-aminobutyric acid type B receptor subunit 2
Ligand
BDBM360690
Substrate
Meas. Tech.
GTPgS Binding Assay
EC50
71.0±n/a nM
Citation
 Faghih, RMoeller, AOchse, MPohlki, FSchmidt, MSippy, KTurner, SVan Der Kam, EL Substituted pyrazolopyrimidines and method of use US Patent  US9828381 Publication Date 11/28/2017 
Target
Name:
Gamma-aminobutyric acid type B receptor subunit 2
Synonyms:
GABA B receptor Gabbr2 | Gpr51
Type:
PROTEIN
Mol. Mass.:
105775.46
Organism:
Rattus norvegicus
Description:
O88871
Residue:
940
  
Inhibitor
Name:
BDBM360690
Synonyms:
US9828381, 2-8
Type:
Small organic molecule
Emp. Form.:
C19H23ClN4
Mol. Mass.:
342.866
SMILES:
CC(c1cc2nc(C)cc(NC(C)(C)C)n2n1)c1ccc(Cl)cc1
: