Target
Complement factor D
Ligand
BDBM360754
Substrate
Meas. Tech.
Inhibition Assay
IC50
<1000±n/a nM
Citation
 Wiles, JAPais, GHashimoto, AGadhachanda, VRWang, QChen, DWang, XAgarwal, ADeshpande, MPhadke, AS Alkyne compounds for treatment of complement mediated disorders US Patent  US9828396 Publication Date 11/28/2017 
Target
Name:
Complement factor D
Synonyms:
Adipsin CFAD_HUMAN DF Properdin factor D
Type:
Protein
Mol. Mass.:
27039.19
Organism:
Homo sapiens (Human)
Description:
P00746
Residue:
253
  
Inhibitor
Name:
BDBM360754
Synonyms:
(2S,4R)-1-(2-(3-acetyl-6- ((trimethylsilyl)ethynyl)-1H- indol-1-yl)acetyl)-N-(3- chloro-2-fluorobenzyl)-4- fluoropyrrolidine-2- carboxamide | US9828396, Compound 3
Type:
Small organic molecule
Emp. Form.:
C29H30ClF2N3O3Si
Mol. Mass.:
570.102
SMILES:
CC(=O)c1cn(CC(=O)N2C[C@H](F)C[C@H]2C(=O)NCc2cccc(Cl)c2F)c2cc(ccc12)C#C[Si](C)(C)C
: