Target
Complement factor D
Ligand
BDBM360824
Substrate
Meas. Tech.
Inhibition Assay
IC50
<1000±n/a nM
Citation
 Wiles, JAPais, GHashimoto, AGadhachanda, VRWang, QChen, DWang, XAgarwal, ADeshpande, MPhadke, AS Alkyne compounds for treatment of complement mediated disorders US Patent  US9828396 Publication Date 11/28/2017 
Target
Name:
Complement factor D
Synonyms:
Adipsin CFAD_HUMAN DF Properdin factor D
Type:
Protein
Mol. Mass.:
27039.19
Organism:
Homo sapiens (Human)
Description:
P00746
Residue:
253
  
Inhibitor
Name:
BDBM360824
Synonyms:
1-(2-((2S,4R)-2-(2'-chloro- 2-fluorobiphenyl-3- ylcarbamoyl)-4- fluoropyrrolidin-1-yl)-2- oxoethyl)-5-(pyridazin-3- ylethynyl)-1H-indazole-3- carboxamide | US9828396, Compound 73
Type:
Small organic molecule
Emp. Form.:
C33H24ClF2N7O3
Mol. Mass.:
640.039
SMILES:
NC(=O)c1nn(CC(=O)N2C[C@H](F)C[C@H]2C(=O)Nc2cccc(c2F)-c2ccccc2Cl)c2ccc(cc12)C#Cc1cccnn1
: