Target
Histone deacetylase 6
Ligand
BDBM19145
Substrate
[3H]acetyl-labeled histones
Meas. Tech.
In Vitro Enzyme Inhibition Assay
pH
8±n/a
Temperature
310.15±n/a K
IC50
170±n/a nM
Citation
 Itoh, YSuzuki, TKouketsu, ASuzuki, NMaeda, SYoshida, MNakagawa, HMiyata, N Design, synthesis, structure-selectivity relationship, and effect on human cancer cells of a novel series of histone deacetylase 6-selective inhibitors. J Med Chem 50:5425-38 (2007)  
Target
Name:
Histone deacetylase 6
Synonyms:
HD6 Hdac6 Histone deacetylase | Histone deacetylase mHDA2
Type:
PROTEIN
Mol. Mass.:
125762.28
Organism:
Mus musculus
Description:
ChEMBL_1460074
Residue:
1149
  
Inhibitor
Name:
BDBM19145
Synonyms:
(2S)-2-[(tert-butylcarbamothioyl)amino]-N-cyclopentyl-7-sulfanylheptanamide | thiolate analogue, 36a
Type:
Small organic molecule
Emp. Form.:
C17H33N3OS2
Mol. Mass.:
359.593
SMILES:
CC(C)(C)NC(=S)N[C@@H](CCCCCS)C(=O)NC1CCCC1
:
Substrate
Name:
[3H]acetyl-labeled histones
Synonyms:
Type:
Other Protein Type
Mol. Mass.:
358.43
Organism:
Bos taurus (bovine)
Description:
Residue:
3
NA