Target
Histone deacetylase 1
Ligand
BDBM19132
Substrate
[3H]acetyl-labeled histones
Meas. Tech.
In Vitro Enzyme Inhibition Assay
pH
8±n/a
Temperature
310.15±n/a K
IC50
62±n/a nM
Citation
 Itoh, YSuzuki, TKouketsu, ASuzuki, NMaeda, SYoshida, MNakagawa, HMiyata, N Design, synthesis, structure-selectivity relationship, and effect on human cancer cells of a novel series of histone deacetylase 6-selective inhibitors. J Med Chem 50:5425-38 (2007)  
Target
Name:
Histone deacetylase 1
Synonyms:
Cereblon/Histone deacetylase 1 HDAC1 Histone deacetylase 1 (HDAC1) RPD3L1
Type:
Enzyme
Mol. Mass.:
55090.27
Organism:
Homo sapiens (Human)
Description:
Q13547
Residue:
482
  
Inhibitor
Name:
BDBM19132
Synonyms:
tert-butyl N-[(1S)-1-[(3-phenylphenyl)carbamoyl]-6-sulfanylhexyl]carbamate | thiolate analogue, 13a
Type:
Small organic molecule
Emp. Form.:
C24H32N2O3S
Mol. Mass.:
428.587
SMILES:
CC(C)(C)OC(=O)N[C@@H](CCCCCS)C(=O)Nc1cccc(c1)-c1ccccc1
:
Substrate
Name:
[3H]acetyl-labeled histones
Synonyms:
Type:
Other Protein Type
Mol. Mass.:
358.43
Organism:
Bos taurus (bovine)
Description:
Residue:
3
NA