Target
Histone deacetylase 6
Ligand
BDBM19154
Substrate
BDBM19150
Meas. Tech.
HDAC Enzyme Activity Assay
pH
8±n/a
Temperature
310.15±n/a K
IC50
4922±686 nM
Comments
MCF7 cells growth inhibition, IC50 >1000 nM.HeLa nuclear HDACs inhibition, IC50=7+/- 2 nM.
Citation
 Yurek-George, ACecil, ARMo, AHWen, SRogers, HHabens, FMaeda, SYoshida, MPackham, GGanesan, A The First Biologically Active Synthetic Analogues of FK228, the Depsipeptide Histone Deacetylase Inhibitor. J Med Chem 50:5720-5726 (2007)  
Target
Name:
Histone deacetylase 6
Synonyms:
HD6 Hdac6 Histone deacetylase | Histone deacetylase mHDA2
Type:
PROTEIN
Mol. Mass.:
125762.28
Organism:
Mus musculus
Description:
ChEMBL_1460074
Residue:
1149
  
Inhibitor
Name:
BDBM19154
Synonyms:
(6R,9R,12R,16R)-9,12-dimethyl-6-(propan-2-yl)-16-[(1E)-4-sulfanylbut-1-en-1-yl]-1-oxa-4,7,10,13-tetraazacyclohexadecane-2,5,8,11,14-pentone | FK228 Analogue, 15a
Type:
Small organic molecule
Emp. Form.:
C20H32N4O6S
Mol. Mass.:
456.556
SMILES:
CC(C)[C@H]1NC(=O)[C@@H](C)NC(=O)[C@@H](C)NC(=O)C[C@@H](OC(=O)CNC1=O)\C=C\CCS
:
Substrate
Name:
BDBM19150
Synonyms:
Ac-Arg-Gly-Lys(Ac)-AMC | Ac-KGLGK(Ac)-AMC
Type:
Fluorescent Peptide
Emp. Form.:
C28H40N8O7
Mol. Mass.:
600.6666
SMILES:
[#6]-[#6](=O)-[#7]-[#6]-[#6]-[#6]-[#6]-[#6@H](-[#7]-[#6](=O)-[#6]-[#7]-[#6](=O)-[#6@H](-[#6]-[#6]-[#6]\[#7]=[#6](\[#7])-[#7])-[#7]-[#6](-[#6])=O)-[#6](=O)-[#7]-c1ccc2c(-[#6])cc(=O)oc2c1
: