Target
Histone deacetylase 6
Ligand
BDBM19158
Substrate
BDBM19150
Meas. Tech.
HDAC Enzyme Activity Assay
pH
8±n/a
Temperature
310.15±n/a K
IC50
621±n/a nM
Citation
 Bhuiyan, MPKato, TOkauchi, TNishino, NMaeda, SNishino, TGYoshida, M Chlamydocin analogs bearing carbonyl group as possible ligand toward zinc atom in histone deacetylases. Bioorg Med Chem 14:3438-46 (2006)  
Target
Name:
Histone deacetylase 6
Synonyms:
HD6 Hdac6 Histone deacetylase | Histone deacetylase mHDA2
Type:
PROTEIN
Mol. Mass.:
125762.28
Organism:
Mus musculus
Description:
ChEMBL_1460074
Residue:
1149
  
Inhibitor
Name:
BDBM19158
Synonyms:
(3S,9S,14aR)-9-benzyl-3-(7-bromo-6-oxoheptyl)-6,6-dimethyl-tetradecahydropyrrolo[1,2-a][,,,]cyclododecane-1,4,7,10-tetrone | chlamydocin-bromomethylketone analog, 4
Type:
Small organic molecule
Emp. Form.:
C27H37BrN4O5
Mol. Mass.:
577.51
SMILES:
CC1(C)NC(=O)[C@H](CCCCCC(=O)CBr)NC(=O)[C@H]2CCCN2C(=O)[C@H](Cc2ccccc2)NC1=O
:
Substrate
Name:
BDBM19150
Synonyms:
Ac-Arg-Gly-Lys(Ac)-AMC | Ac-KGLGK(Ac)-AMC
Type:
Fluorescent Peptide
Emp. Form.:
C28H40N8O7
Mol. Mass.:
600.6666
SMILES:
[#6]-[#6](=O)-[#7]-[#6]-[#6]-[#6]-[#6]-[#6@H](-[#7]-[#6](=O)-[#6]-[#7]-[#6](=O)-[#6@H](-[#6]-[#6]-[#6]\[#7]=[#6](\[#7])-[#7])-[#7]-[#6](-[#6])=O)-[#6](=O)-[#7]-c1ccc2c(-[#6])cc(=O)oc2c1
: