Target
Amine oxidase [flavin-containing] A
Ligand
BDBM19174
Substrate
BDBM10990
Meas. Tech.
MAO Inhibition Assay
pH
7.4±n/a
Temperature
310.15±n/a K
IC50
47100±7600 nM
Citation
 Carotti, ACatto, MLeonetti, FCampagna, FSoto-Otero, RMéndez-Alvarez, EThull, UTesta, BAltomare, C Synthesis and monoamine oxidase inhibitory activity of new pyridazine-, pyrimidine- and 1,2,4-triazine-containing tricyclic derivatives. J Med Chem 50:5364-71 (2007)  
Target
Name:
Amine oxidase [flavin-containing] A
Synonyms:
AOFA_RAT Amine oxidase [flavin-containing] A Monoamine Oxidase Type A (MAO-A) Monoamine oxidase A (MAO-A) Monoamine oxidase type A (MAOA)
Type:
Enzyme
Mol. Mass.:
59515.21
Organism:
Rattus norvegicus (rat)
Description:
Residue:
526
  
Inhibitor
Name:
BDBM19174
Synonyms:
2-methyl-9H-indeno[2,1-d]pyrimidin-9-one | Aza-heterocyclic Derivative, 2a
Type:
Small organic molecule
Emp. Form.:
C12H8N2O
Mol. Mass.:
196.2047
SMILES:
Cc1ncc2-c3ccccc3C(=O)c2n1
:
Substrate
Name:
BDBM10990
Synonyms:
3-amino-1-(2-aminophenyl)propan-1-one Kynuramine
Type:
Small organic molecule
Emp. Form.:
C9H12N2O
Mol. Mass.:
164.2044
SMILES:
NCCC(=O)c1ccccc1N
: