Target
Metabotropic glutamate receptor 4
Ligand
BDBM361360
Substrate
Meas. Tech.
Metabotropic Glutamate Receptor Activity
EC50
607±n/a nM
Citation
 Conn, PJHopkins, CRLindsley, CWNiswender, CMEngers, DWBollinger, S Benzothiazole and benzisothiazole-substituted compounds as mGluR4 allosteric potentiators, compositions, and methods of treating neurological dysfunction US Patent  US10221172 Publication Date 3/5/2019 
Target
Name:
Metabotropic glutamate receptor 4
Synonyms:
GPRC1D GRM4_HUMAN MGLUR4 Metabotropic glutamate receptor 4 (mGlu4) metabotropic glutamate 4
Type:
Protein
Mol. Mass.:
101899.95
Organism:
Homo sapiens (Human)
Description:
Q14833
Residue:
912
  
Inhibitor
Name:
BDBM361360
Synonyms:
(6-((1H-pyrazolo[4,3-b] pyridin-3-yl) amino)benzo[d]isothiazol- 3-yl)(1,4- oxazepan-4-yl)methanone | US10221172, Example 17
Type:
Small organic molecule
Emp. Form.:
C19H18N6O2S
Mol. Mass.:
394.45
SMILES:
O=C(N1CCCOCC1)c1nsc2cc(Nc3n[nH]c4cccnc34)ccc12
: