Target
Metabotropic glutamate receptor 4
Ligand
BDBM361375
Substrate
Meas. Tech.
Metabotropic Glutamate Receptor Activity
EC50
1529±n/a nM
Citation
 Conn, PJHopkins, CRLindsley, CWNiswender, CMEngers, DWBollinger, S Benzothiazole and benzisothiazole-substituted compounds as mGluR4 allosteric potentiators, compositions, and methods of treating neurological dysfunction US Patent  US10221172 Publication Date 3/5/2019 
Target
Name:
Metabotropic glutamate receptor 4
Synonyms:
GPRC1D GRM4_HUMAN MGLUR4 Metabotropic glutamate receptor 4 (mGlu4) metabotropic glutamate 4
Type:
Protein
Mol. Mass.:
101899.95
Organism:
Homo sapiens (Human)
Description:
Q14833
Residue:
912
  
Inhibitor
Name:
BDBM361375
Synonyms:
4-(6-((1H-pyrazolo[3,4-b] pyrazin-3-yl)amino)benzo [d]isothiazole-3-carbonyl)- 1-methylpiperazin-2-one | US10221172, Example 32
Type:
Small organic molecule
Emp. Form.:
C18H16N8O2S
Mol. Mass.:
408.437
SMILES:
CN1CCN(CC1=O)C(=O)c1nsc2cc(Nc3n[nH]c4nccnc34)ccc12
: