Target
Metabotropic glutamate receptor 4
Ligand
BDBM361378
Substrate
Meas. Tech.
Metabotropic Glutamate Receptor Activity
EC50
78.2±n/a nM
Citation
 Conn, PJHopkins, CRLindsley, CWNiswender, CMEngers, DWBollinger, S Benzothiazole and benzisothiazole-substituted compounds as mGluR4 allosteric potentiators, compositions, and methods of treating neurological dysfunction US Patent  US10221172 Publication Date 3/5/2019 
Target
Name:
Metabotropic glutamate receptor 4
Synonyms:
GPRC1D GRM4_HUMAN MGLUR4 Metabotropic glutamate receptor 4 (mGlu4) metabotropic glutamate 4
Type:
Protein
Mol. Mass.:
101899.95
Organism:
Homo sapiens (Human)
Description:
Q14833
Residue:
912
  
Inhibitor
Name:
BDBM361378
Synonyms:
3-cyclopropyl-N- (1H-pyrazolo [4,3-b]pyridin-3-yl) benzo[d]isothiazol- 6-amine | US10221172, Example 36
Type:
Small organic molecule
Emp. Form.:
C16H13N5S
Mol. Mass.:
307.373
SMILES:
C1CC1c1nsc2cc(Nc3n[nH]c4cccnc34)ccc12
: