Target
Metabotropic glutamate receptor 4
Ligand
BDBM361384
Substrate
Meas. Tech.
Metabotropic Glutamate Receptor Activity
EC50
100.0±n/a nM
Citation
 Conn, PJHopkins, CRLindsley, CWNiswender, CMEngers, DWBollinger, S Benzothiazole and benzisothiazole-substituted compounds as mGluR4 allosteric potentiators, compositions, and methods of treating neurological dysfunction US Patent  US10221172 Publication Date 3/5/2019 
Target
Name:
Metabotropic glutamate receptor 4
Synonyms:
GPRC1D GRM4_HUMAN MGLUR4 Metabotropic glutamate receptor 4 (mGlu4) metabotropic glutamate 4
Type:
Protein
Mol. Mass.:
101899.95
Organism:
Homo sapiens (Human)
Description:
Q14833
Residue:
912
  
Inhibitor
Name:
BDBM361384
Synonyms:
3-ethyl-N-(1H- pyrazolo[3,4-b] pyridin-3-yl)isothiazolo [4,5-b]pyridin-6-amine | US10221172, Example 42
Type:
Small organic molecule
Emp. Form.:
C14H12N6S
Mol. Mass.:
296.35
SMILES:
CCc1nsc2cc(Nc3n[nH]c4ncccc34)cnc12
: