Target
Metabotropic glutamate receptor 4
Ligand
BDBM361389
Substrate
Meas. Tech.
Metabotropic Glutamate Receptor Activity
EC50
1065±n/a nM
Citation
 Conn, PJHopkins, CRLindsley, CWNiswender, CMEngers, DWBollinger, S Benzothiazole and benzisothiazole-substituted compounds as mGluR4 allosteric potentiators, compositions, and methods of treating neurological dysfunction US Patent  US10221172 Publication Date 3/5/2019 
Target
Name:
Metabotropic glutamate receptor 4
Synonyms:
GPRC1D GRM4_HUMAN MGLUR4 Metabotropic glutamate receptor 4 (mGlu4) metabotropic glutamate 4
Type:
Protein
Mol. Mass.:
101899.95
Organism:
Homo sapiens (Human)
Description:
Q14833
Residue:
912
  
Inhibitor
Name:
BDBM361389
Synonyms:
(6-((1H-pyrazolo[4,3-b] pyridin-3-yl)amino) isothiazolo[4,5-b] pyridin-3- yl)methanol | US10221172, Example 47
Type:
Small organic molecule
Emp. Form.:
C13H10N6OS
Mol. Mass.:
298.323
SMILES:
OCc1nsc2cc(Nc3n[nH]c4cccnc34)cnc12
: