Target
Metabotropic glutamate receptor 4
Ligand
BDBM361401
Substrate
Meas. Tech.
Metabotropic Glutamate Receptor Activity
EC50
353±n/a nM
Citation
 Conn, PJHopkins, CRLindsley, CWNiswender, CMEngers, DWBollinger, S Benzothiazole and benzisothiazole-substituted compounds as mGluR4 allosteric potentiators, compositions, and methods of treating neurological dysfunction US Patent  US10221172 Publication Date 3/5/2019 
Target
Name:
Metabotropic glutamate receptor 4
Synonyms:
GPRC1D GRM4_HUMAN MGLUR4 Metabotropic glutamate receptor 4 (mGlu4) metabotropic glutamate 4
Type:
Protein
Mol. Mass.:
101899.95
Organism:
Homo sapiens (Human)
Description:
Q14833
Residue:
912
  
Inhibitor
Name:
BDBM361401
Synonyms:
(S)-3-((2- methylmorpholino) methyl)-N-(1H- pyrazolo[4,3-b]pyridin-3- yl)isothiazolo[4,5-b] pyridin-6-amine | US10221172, Example 59
Type:
Small organic molecule
Emp. Form.:
C18H19N7OS
Mol. Mass.:
381.455
SMILES:
C[C@H]1CN(Cc2nsc3cc(Nc4n[nH]c5cccnc45)cnc23)CCO1
: