Target
Androgen receptor
Ligand
BDBM238895
Substrate
Meas. Tech.
mmTV-luciferase reporter assay
pH
7.5±n/a
IC50
1000±0.24 nM
Comments
extracted
Citation
 England, PMFletterick, RJKuchenbecker, KCortez, F Androgen receptor antagonists US Patent  US10053433 Publication Date 8/21/2018 
Target
Name:
Androgen receptor
Synonyms:
ANDR_HUMAN Androgen Receptor Androgen receptor/Baculoviral IAP repeat-containing protein 2 Dihydrotestosterone receptor Nuclear receptor subfamily 3 group C member 4
Type:
Receptor
Mol. Mass.:
99185.27
Organism:
Homo sapiens (Human)
Description:
CHO cells were stably transfected with human AR gene.
Residue:
920
  
Inhibitor
Name:
BDBM238895
Synonyms:
US10053433, Casodex (CDX) | US10053433, FC 4.037 (N- CDX)
Type:
Small organic molecule
Emp. Form.:
C17H13F4N3O4S
Mol. Mass.:
431.361
SMILES:
C[C@](O)(CS(=O)(=O)c1ccc(F)cc1)C(=O)Nc1cnc(C#N)c(c1)C(F)(F)F
: