Target
Androgen receptor
Ligand
BDBM239363
Substrate
Meas. Tech.
Gal4-luciferase reporter assay
pH
7.5±n/a
IC50
1550±0.41 nM
Comments
extracted
Citation
 England, PMFletterick, RJKuchenbecker, KCortez, F Androgen receptor antagonists US Patent  US10053433 Publication Date 8/21/2018 
Target
Name:
Androgen receptor
Synonyms:
ANDR_HUMAN Androgen Receptor Androgen receptor/Baculoviral IAP repeat-containing protein 2 Dihydrotestosterone receptor Nuclear receptor subfamily 3 group C member 4
Type:
Receptor
Mol. Mass.:
99185.27
Organism:
Homo sapiens (Human)
Description:
CHO cells were stably transfected with human AR gene.
Residue:
920
  
Inhibitor
Name:
BDBM239363
Synonyms:
US10053433, FC 4.126
Type:
Small organic molecule
Emp. Form.:
C16H14F4N2O4S
Mol. Mass.:
406.352
SMILES:
C[C@](O)(CS(=O)(=O)c1ccc(F)cc1)C(=O)Nc1cc(ccn1)C(F)(F)F
: