Target
Androgen receptor
Ligand
BDBM242618
Substrate
Meas. Tech.
Gal4-luciferase reporter assay
pH
7.5±n/a
IC50
580±0.11 nM
Comments
extracted
Citation
 England, PMFletterick, RJKuchenbecker, KCortez, F Androgen receptor antagonists US Patent  US10053433 Publication Date 8/21/2018 
Target
Name:
Androgen receptor
Synonyms:
ANDR_HUMAN Androgen Receptor Androgen receptor/Baculoviral IAP repeat-containing protein 2 Dihydrotestosterone receptor Nuclear receptor subfamily 3 group C member 4
Type:
Receptor
Mol. Mass.:
99185.27
Organism:
Homo sapiens (Human)
Description:
CHO cells were stably transfected with human AR gene.
Residue:
920
  
Inhibitor
Name:
BDBM242618
Synonyms:
US10053433, FC 4.025
Type:
Small organic molecule
Emp. Form.:
C22H21F4NO8S3
Mol. Mass.:
599.593
SMILES:
C[C@](O)(CS(=O)(=O)c1ccc(F)cc1)C(=O)Nc1ccc(C(S(=O)(=O)C=C)S(=O)(=O)C=C)c(c1)C(F)(F)F
: