Target
Glucocorticoid receptor
Ligand
BDBM19195
Substrate
BDBM18207
Meas. Tech.
GR Binding Assay and Human IL-6 Assay
pH
7.5±n/a
Temperature
277.15±n/a K
IC50
9.5±n/a nM
EC50
19.5±n/a nM
Citation
 Ali, AThompson, CFBalkovec, JMGraham, DWHammond, MLQuraishi, NTata, JREinstein, MGe, LHarris, GKelly, TMMazur, PPandit, SSantoro, JSitlani, AWang, CWilliamson, JMiller, DKThompson, CMZaller, DMForrest, MJCarballo-Jane, ELuell, S Novel N-arylpyrazolo[3,2-c]-based ligands for the glucocorticoid receptor: receptor binding and in vivo activity. J Med Chem 47:2441-52 (2004)  
Target
Name:
Glucocorticoid receptor
Synonyms:
GCR_HUMAN GRL Glucocorticoid receptor (GRFP) Nuclear receptor subfamily 3 group C member 1
Type:
Enzyme
Mol. Mass.:
85656.87
Organism:
Homo sapiens (Human)
Description:
P04150
Residue:
777
  
Inhibitor
Name:
BDBM19195
Synonyms:
4-[(R)-[(4aR,5S)-1-(4-fluorophenyl)-4a-methyl-1H,4H,4aH,5H,6H,7H,8H-cyclohexa[f]indazol-5-yl](hydroxy)methyl]phenol | N-Arylpyrazolo[3,2-c]-Based Ligand, 14
Type:
Small organic molecule
Emp. Form.:
C25H25FN2O2
Mol. Mass.:
404.4766
SMILES:
[H][C@@]1(CCCC2=Cc3c(C[C@]12C)cnn3-c1ccc(F)cc1)[C@@H](O)c1ccc(O)cc1
:
Substrate
Name:
BDBM18207
Synonyms:
(1R,2S,10S,11S,13R,14R,15S,17S)-1-fluoro-14,17-dihydroxy-14-(2-hydroxyacetyl)-2,13,15-trimethyltetracyclo[8.7.0.0^{2,7}.0^{11,15}]heptadeca-3,6-dien-5-one US11554172, Compound Dexamethasone dexamethasone (tetramethyl-rhodamine conjugated )
Type:
Steroid
Emp. Form.:
C22H29FO5
Mol. Mass.:
392.4611
SMILES:
[H][C@@]12C[C@@H](C)[C@](O)(C(=O)CO)[C@@]1(C)C[C@H](O)[C@@]1(F)[C@@]2([H])CCC2=CC(=O)C=C[C@]12C
: