Target
Estrogen receptor
Ligand
BDBM361441
Substrate
Meas. Tech.
MCF-7 ER Down-Regulation Assay
IC50
0.081±n/a nM
Citation
 Nissink, JWScott, JSMoss, TAHughes, SJBarlaam, BCYang, B Chemical compounds US Patent  US10221173 Publication Date 3/5/2019 
Target
Name:
Estrogen receptor
Synonyms:
ER ESR ESR1_HUMAN Estrogen receptor Estrogen receptor (ER-alpha) Estrogen receptor alpha (ER) Nuclear receptor subfamily 3 group A member 1
Type:
Protein
Mol. Mass.:
66230.44
Organism:
Homo sapiens (Human)
Description:
P03372
Residue:
595
  
Inhibitor
Name:
BDBM361441
Synonyms:
3-fluoro-N-(2- (4-fluoro-2- methyl-3- ((1R,3R)-3- methyl-2- (2,2,2- trifluoroethyl)- 2,3,4,9- tetrahydro-1H- pyrido[3,4- b]indol-1- yl)phenoxy) ethyl)propan-1- amine US10590132, Example 33 | US11046689, Example 33
Type:
Small organic molecule
Emp. Form.:
C26H30F5N3O
Mol. Mass.:
495.5279
SMILES:
C[C@@H]1Cc2c([nH]c3ccccc23)[C@H](N1CC(F)(F)F)c1c(F)ccc(OCCNCCCF)c1C
: