Target
Progesterone receptor
Ligand
BDBM19238
Substrate
BDBM8903
Meas. Tech.
Competitive Receptor Binding Assay
pH
8±n/a
Temperature
277.15±n/a K
IC50
150±n/a nM
Citation
 Link, JTSorensen, BPatel, JGrynfarb, MGoos-Nilsson, AWang, JFung, SWilcox, DZinker, BNguyen, PHickman, BSchmidt, JMSwanson, STian, ZReisch, TJRotert, GDu, JLane, Bvon Geldern, TWJacobson, PB Antidiabetic activity of passive nonsteroidal glucocorticoid receptor modulators. J Med Chem 48:5295-304 (2005)  
Target
Name:
Progesterone receptor
Synonyms:
NR3C3 PGR PRGR_HUMAN | progesterone
Type:
Protein
Mol. Mass.:
98979.52
Organism:
Homo sapiens (Human)
Description:
P06401
Residue:
933
  
Inhibitor
Name:
BDBM19238
Synonyms:
2-{2-chloro-5-[4-({[(2,4-difluorophenyl)methyl](3-methanesulfonamido-2-methylphenyl)amino}methyl)phenoxy]phenoxy}acetic acid | GR sulfonamide modulator, 15
Type:
Small organic molecule
Emp. Form.:
C30H27ClF2N2O6S
Mol. Mass.:
617.06
SMILES:
Cc1c(NS(C)(=O)=O)cccc1N(Cc1ccc(Oc2ccc(Cl)c(OCC(O)=O)c2)cc1)Cc1ccc(F)cc1F
:
Substrate
Name:
BDBM8903
Synonyms:
(1S,2R,10S,11S,14S,15S)-14-acetyl-2,15-dimethyltetracyclo[8.7.0.0^{2,7}.0^{11,15}]heptadec-6-en-5-one progesterone
Type:
Steroid
Emp. Form.:
C21H30O2
Mol. Mass.:
314.4617
SMILES:
[H][C@@]12CC[C@H](C(C)=O)[C@@]1(C)CC[C@@]1([H])[C@@]2([H])CCC2=CC(=O)CC[C@]12C
: