Target
Inosine-5'-monophosphate dehydrogenase 2
Ligand
BDBM19285
Substrate
BDBM19254
Meas. Tech.
IMPDH2 Enzyme Inhibition and Human T-Lymphoblast (CEM) Proliferation Inhibition Assays
pH
8±n/a
Temperature
298.15±n/a K
IC50
17±4.0 nM
EC50
920±120 nM
Citation
 Watterson, SHChen, PZhao, YGu, HHDhar, TGXiao, ZBallentine, SKShen, ZFleener, CARouleau, KAObermeier, MYang, ZMcIntyre, KWShuster, DJWitmer, MDambach, DChao, SMathur, AChen, BCBarrish, JCRobl, JATownsend, RIwanowicz, EJ Acridone-based inhibitors of inosine 5'-monophosphate dehydrogenase: discovery and SAR leading to the identification of N-(2-(6-(4-ethylpiperazin-1-yl)pyridin-3-yl)propan-2-yl)-2- fluoro-9-oxo-9,10-dihydroacridine-3-carboxamide (BMS-566419). J Med Chem 50:3730-42 (2007)  
Target
Name:
Inosine-5'-monophosphate dehydrogenase 2
Synonyms:
IMDH2_HUMAN IMPD 2 IMPDH-II Inosine 5'-monophosphate dehydrogenase II (IMPDH II) Inosine-5 -monophosphate dehydrogenase 2 | Inosine-5'-monophosphate dehydrogenase (IMPDH)
Type:
Enzyme
Mol. Mass.:
55806.87
Organism:
Homo sapiens (Human)
Description:
Recombinant IMPDH2 expressed in E. coli.
Residue:
514
  
Inhibitor
Name:
BDBM19285
Synonyms:
2-fluoro-9-oxo-N-(2-{2H,3H,4H-pyrido[3,2-b][1,4]oxazin-7-yl}propan-2-yl)-9,10-dihydroacridine-3-carboxamide | Acridone-Based Inhibitor, 4i
Type:
Small organic molecule
Emp. Form.:
C24H21FN4O3
Mol. Mass.:
432.4469
SMILES:
CC(C)(NC(=O)c1cc2[nH]c3ccccc3c(=O)c2cc1F)c1cnc2NCCOc2c1
:
Substrate
Name:
BDBM19254
Synonyms:
IMP Inosinic acid [(2R,3S,4R,5R)-3,4-dihydroxy-5-(6-oxo-3H-purin-9-yl)oxolan-2-yl]methyl dihydrogen {[(2R,3S,4R,5R)-3,4-dihydroxy-5-(6-oxo-6,9-dihydro-3H-purin-9-yl)oxolan-2-yl]methoxy}phosphonic acid
Type:
Nucleoside or nucleotide
Emp. Form.:
C10H13N4O8P
Mol. Mass.:
348.206
SMILES:
O[C@@H]1[C@@H](COP(O)(O)=O)O[C@H]([C@@H]1O)n1cnc2c1nc[nH]c2=O
: