Target
Growth hormone secretagogue receptor type 1
Ligand
BDBM19295
Substrate
125I-His9-ghrelin
Meas. Tech.
Receptor Binding Studies
pH
7.3±n/a
Temperature
298.15±n/a K
IC50
138±23 nM
Comments
2 +/- 3 % of max [Ca2+] response @ 10 uM.
Citation
 Moulin, ADemange, LBergé, GGagne, DRyan, JMousseaux, DHeitz, APerrissoud, DLocatelli, VTorsello, AGalleyrand, JCFehrentz, JAMartinez, J Toward Potent Ghrelin Receptor Ligands Based on Trisubstituted 1,2,4-Triazole Structure. 2. Synthesis and Pharmacological in Vitro and in Vivo Evaluations. J Med Chem 50:5790-5806 (2007)  
Target
Name:
Growth hormone secretagogue receptor type 1
Synonyms:
GH-releasing peptide receptor GHS-R GHSR_HUMAN Ghrelin receptor | Ghrelin receptor 1a (GHS-R1a)
Type:
Receptor
Mol. Mass.:
41334.57
Organism:
Homo sapiens (Human)
Description:
Receptor binding studies use plasma membranes from LLC PK-1 cells transiently transfected with hGHSR1a.
Residue:
366
  
Inhibitor
Name:
BDBM19295
Synonyms:
2-amino-N-[(1R)-2-(1H-indol-3-yl)-1-{5-[2-(1H-indol-3-yl)ethyl]-4-[(4-methoxyphenyl)methyl]-4H-1,2,4-triazol-3-yl}ethyl]acetamide | Trisubstituted 1,2,4-Triazole, 3
Type:
Small organic molecule
Emp. Form.:
C32H33N7O2
Mol. Mass.:
547.6501
SMILES:
COc1ccc(Cn2c(CCc3c[nH]c4ccccc34)nnc2[C@@H](Cc2c[nH]c3ccccc23)NC(=O)CN)cc1
:
Substrate
Name:
125I-His9-ghrelin
Synonyms:
radiolabeled peptide ligand
Type:
Peptide
Mol. Mass.:
9033.11
Organism:
Description:
Residue:
82