Target
Growth hormone secretagogue receptor type 1
Ligand
BDBM19326
Substrate
125I-His9-ghrelin
Meas. Tech.
Receptor Binding Studies
IC50
11±n/a nM
Kd
27±n/a nM
Citation
 Moulin, ADemange, LBergé, GGagne, DRyan, JMousseaux, DHeitz, APerrissoud, DLocatelli, VTorsello, AGalleyrand, JCFehrentz, JAMartinez, J Toward Potent Ghrelin Receptor Ligands Based on Trisubstituted 1,2,4-Triazole Structure. 2. Synthesis and Pharmacological in Vitro and in Vivo Evaluations. J Med Chem 50:5790-5806 (2007)  
Target
Name:
Growth hormone secretagogue receptor type 1
Synonyms:
GH-releasing peptide receptor GHS-R GHSR_HUMAN Ghrelin receptor | Ghrelin receptor 1a (GHS-R1a)
Type:
Receptor
Mol. Mass.:
41334.57
Organism:
Homo sapiens (Human)
Description:
Receptor binding studies use plasma membranes from LLC PK-1 cells transiently transfected with hGHSR1a.
Residue:
366
  
Inhibitor
Name:
BDBM19326
Synonyms:
(2S)-N-[(1R)-2-(1H-indol-3-yl)-1-{4-[(4-methoxyphenyl)methyl]-5-(2-phenylethyl)-4H-1,2,4-triazol-3-yl}ethyl]piperidine-2-carboxamide | Trisubstituted 1,2,4-Triazole, 34
Type:
Small organic molecule
Emp. Form.:
C34H38N6O2
Mol. Mass.:
562.7045
SMILES:
COc1ccc(Cn2c(CCc3ccccc3)nnc2[C@@H](Cc2c[nH]c3ccccc23)NC(=O)[C@@H]2CCCCN2)cc1
:
Substrate
Name:
125I-His9-ghrelin
Synonyms:
radiolabeled peptide ligand
Type:
Peptide
Mol. Mass.:
9033.11
Organism:
Description:
Residue:
82