Target
Apoptosis regulator Bcl-2
Ligand
BDBM361574
Substrate
Meas. Tech.
Bcl-2 and Bcl-xL Inhibition
IC50
1.20±n/a nM
Citation
 Wang, SChen, J N-(phenylsulfonyl)benzamides and related compounds as BCL-2 inhibitors US Patent  US10221174 Publication Date 3/5/2019 
Target
Name:
Apoptosis regulator Bcl-2
Synonyms:
Apoptosis regulator Bcl-2 Protein BCL-2 BCL2_HUMAN | Bcl-2 Protein
Type:
Homodimer or heterodimer
Mol. Mass.:
26269.11
Organism:
Homo sapiens (Human)
Description:
P10415
Residue:
239
  
Inhibitor
Name:
BDBM361574
Synonyms:
2-((1H-pyrrolo[2,3-b]pyridin-5-yl)oxy)-4-(4-((6-(4- chlorophenyl)spiro[3.5]non-6-en-7- yl)methyl)piperazin-1-yl)-N-((3-nitro-4- (((tetrahydro-2H-pyran-4- yl)methyl)amino)phenyl)sulfonyl)benzamide US10829488, Compound 3 | US11718613, Compound 3
Type:
Small organic molecule
Emp. Form.:
C46H50ClN7O7S
Mol. Mass.:
880.45
SMILES:
[O-][N+](=O)c1cc(ccc1NCC1CCOCC1)S(=O)(=O)NC(=O)c1ccc(cc1Oc1cnc2[nH]ccc2c1)N1CCN(CC2=C(CC3(CCC3)CC2)c2ccc(Cl)cc2)CC1
: